Target
Tyrosine-protein kinase SYK
Ligand
BDBM182783
Substrate
Meas. Tech.
Syk Kinase Inhibition Assay
pH
7.5±n/a
Temperature
298.15±n/a K
IC50
0.26±n/a nM
Comments
extracted
Citation
 Sakamoto, TMita, TShibata, KOgino, YKomatani, H 1,2,4-triazine-6-carboxamide derivative US Patent  US9145414 Publication Date 9/29/2015 
Target
Name:
Tyrosine-protein kinase SYK
Synonyms:
KSYK_HUMAN Spleen Tyrosine Kinase Tyrosine-protein kinase SYK (Syk)
Type:
Enzyme
Mol. Mass.:
72079.99
Organism:
Homo sapiens (Human)
Description:
P43405
Residue:
635
  
Inhibitor
Name:
BDBM182783
Synonyms:
US9145414, 67
Type:
Small organic molecule
Emp. Form.:
C22H26N10O
Mol. Mass.:
446.5082
SMILES:
Cn1cc(cn1)-n1ccc2c(Nc3nc(N[C@@H]4CCCC[C@@H]4N)nnc3C(N)=O)cccc12
: