Target
Tyrosine-protein kinase SYK
Ligand
BDBM182789
Substrate
Meas. Tech.
Syk Kinase Inhibition Assay
pH
7.5±n/a
Temperature
298.15±n/a K
IC50
0.26±n/a nM
Comments
extracted
Citation
 Sakamoto, TMita, TShibata, KOgino, YKomatani, H 1,2,4-triazine-6-carboxamide derivative US Patent  US9145414 Publication Date 9/29/2015 
Target
Name:
Tyrosine-protein kinase SYK
Synonyms:
KSYK_HUMAN Spleen Tyrosine Kinase Tyrosine-protein kinase SYK (Syk)
Type:
Enzyme
Mol. Mass.:
72079.99
Organism:
Homo sapiens (Human)
Description:
P43405
Residue:
635
  
Inhibitor
Name:
BDBM182789
Synonyms:
US9145414, 91
Type:
Small organic molecule
Emp. Form.:
C19H25N9O
Mol. Mass.:
395.4615
SMILES:
Cc1cc(Nc2nc(N[C@@H]3CCCC[C@@H]3N)nnc2C(N)=O)cc2nn(C)cc12
: