Target
Tyrosine-protein kinase SYK
Ligand
BDBM182799
Substrate
Meas. Tech.
Syk Kinase Inhibition Assay
pH
7.5±n/a
Temperature
298.15±n/a K
IC50
0.29±n/a nM
Comments
extracted
Citation
 Sakamoto, TMita, TShibata, KOgino, YKomatani, H 1,2,4-triazine-6-carboxamide derivative US Patent  US9145414 Publication Date 9/29/2015 
Target
Name:
Tyrosine-protein kinase SYK
Synonyms:
KSYK_HUMAN Spleen Tyrosine Kinase Tyrosine-protein kinase SYK (Syk)
Type:
Enzyme
Mol. Mass.:
72079.99
Organism:
Homo sapiens (Human)
Description:
P43405
Residue:
635
  
Inhibitor
Name:
BDBM182799
Synonyms:
US9145414, 164
Type:
Small organic molecule
Emp. Form.:
C20H23N7OS
Mol. Mass.:
409.508
SMILES:
N[C@H]1CCCC[C@H]1Nc1nnc(C(N)=O)c(Nc2cc(cs2)-c2ccccc2)n1
: