Target
Tyrosine-protein kinase SYK
Ligand
BDBM182816
Substrate
Meas. Tech.
Syk Kinase Inhibition Assay
pH
7.5±n/a
Temperature
298.15±n/a K
IC50
0.48±n/a nM
Comments
extracted
Citation
 Sakamoto, TMita, TShibata, KOgino, YKomatani, H 1,2,4-triazine-6-carboxamide derivative US Patent  US9145414 Publication Date 9/29/2015 
Target
Name:
Tyrosine-protein kinase SYK
Synonyms:
KSYK_HUMAN Spleen Tyrosine Kinase Tyrosine-protein kinase SYK (Syk)
Type:
Enzyme
Mol. Mass.:
72079.99
Organism:
Homo sapiens (Human)
Description:
P43405
Residue:
635
  
Inhibitor
Name:
BDBM182816
Synonyms:
US9145414, 282
Type:
Small organic molecule
Emp. Form.:
C20H26N8O2
Mol. Mass.:
410.4728
SMILES:
CCOC[C@H](N)[C@@H](C)Nc1nnc(C(N)=O)c(Nc2cc(C)c3ncccc3c2)n1
: