Target
Sphingosine 1-phosphate receptor 1
Ligand
BDBM183676
Substrate
Meas. Tech.
Binding Assay
pH
7.4±n/a
Temperature
277.15±n/a K
Ki
10±n/a nM
Comments
extracted
Citation
 Bombrun, ASchwarz, MCrosignani, SCovini, DMarin, D 6-amino-pyrimidine-4-carboxamide derivatives and related compounds which bind to the sphingosine 1-phosphate (S1P) receptor for the treatment of multiple sclerosis US Patent  US9150519 Publication Date 10/6/2015 
Target
Name:
Sphingosine 1-phosphate receptor 1
Synonyms:
CHEDG1 Endothelial differentiation G-protein coupled receptor 1 S1P1 S1PR1_HUMAN Sphingosine 1-phosphate receptor Edg-1
Type:
Enzyme
Mol. Mass.:
42836.02
Organism:
Homo sapiens (Human)
Description:
P21453
Residue:
382
  
Inhibitor
Name:
BDBM183676
Synonyms:
US9150519, 1-69
Type:
Small organic molecule
Emp. Form.:
C21H26N6O
Mol. Mass.:
378.4707
SMILES:
CC(C)CN(C1CCCC1)c1cc(ncn1)C(=O)Nc1ccc2[nH]ncc2c1
: