Target
Sphingosine 1-phosphate receptor 3
Ligand
BDBM183668
Substrate
Meas. Tech.
35S-GTPgammaS Binding
pH
7.4±n/a
Temperature
303.15±n/a K
EC50
>20000±n/a nM
Comments
extracted
Citation
 Bombrun, ASchwarz, MCrosignani, SCovini, DMarin, D 6-amino-pyrimidine-4-carboxamide derivatives and related compounds which bind to the sphingosine 1-phosphate (S1P) receptor for the treatment of multiple sclerosis US Patent  US9150519 Publication Date 10/6/2015 
Target
Name:
Sphingosine 1-phosphate receptor 3
Synonyms:
C9orf108 EDG3 S1P receptor 3 S1P3 S1PR3_HUMAN Sphingosine 1-phosphate receptor 3 (S1P3) | Sphingosine 1-phosphate receptor Edg-3
Type:
G Protein-Coupled Receptor (GPCR)
Mol. Mass.:
42278.13
Organism:
Homo sapiens (Human)
Description:
Q99500
Residue:
378
  
Inhibitor
Name:
BDBM183668
Synonyms:
US9150519, 1-56
Type:
Small organic molecule
Emp. Form.:
C19H25N5O3S
Mol. Mass.:
403.499
SMILES:
CCCN(CC1CC1)c1cc(ncn1)C(=O)Nc1ccc(cc1C)S(N)(=O)=O
: