Target
Coagulation factor X
Ligand
BDBM182990
Substrate
Meas. Tech.
Inhibition Assay
pH
7±n/a
IC50
2±n/a nM
Comments
extracted
Citation
 Alet, NAltenburger, JHerault, JKirsch, RLassalle, GMallart, SPhilippo-Orts, M Sulphonylaminopyrrolidinone derivatives, their preparation and their therapeutic application US Patent  US9150544 Publication Date 10/6/2015 
Target
Name:
Coagulation factor X
Synonyms:
Activated coagulation factor X (FXa) Coagulation factor X precursor F10 Factor X heavy chain Factor Xa Stuart-Prower factor
Type:
Enzyme
Mol. Mass.:
54726.60
Organism:
Homo sapiens (Human)
Description:
Residue:
488
  
Inhibitor
Name:
BDBM182990
Synonyms:
US9150544, 24
Type:
Small organic molecule
Emp. Form.:
C24H28N6O6S
Mol. Mass.:
528.581
SMILES:
COc1cc2c(N)nccc2cc1C[C@@H](N1CC[C@H](NS(=O)(=O)c2ccc(nc2)N(C)C)C1=O)C(O)=O
: