Target
Glycylpeptide N-tetradecanoyltransferase
Ligand
BDBM184899
Substrate
Meas. Tech.
Enzyme Inhibition Assay
pH
7.4±n/a
Temperature
298.15±n/a K
IC50
40±n/a nM
Comments
extracted
Citation
 Brand, SWyatt, PThompson, SSmith, VBayliss, THarrison, JNorcross, NCleghorn, LGilbert, IBrenk, R N-myristoyl transferase inhibitors US Patent  US9156811 Publication Date 10/13/2015 
Target
Name:
Glycylpeptide N-tetradecanoyltransferase
Synonyms:
N-myristoyltransferase (NMT1)
Type:
Protein
Mol. Mass.:
50529.16
Organism:
Trypanosoma brucei
Description:
Q388H8
Residue:
446
  
Inhibitor
Name:
BDBM184899
Synonyms:
US9156811, DDD86478
Type:
Small organic molecule
Emp. Form.:
C19H20Cl2N6O2S
Mol. Mass.:
467.372
SMILES:
Cn1cc(N[S+]([O-])(=O)c2c(Cl)cc(cc2Cl)-c2ccnc(c2)N2CCNCC2)cn1
: