Target
Ferrochelatase, mitochondrial [R115L]
Ligand
BDBM50429701
Substrate
Meas. Tech.
Competition Binding Assays
Kd
3.4e+3±n/a nM
Citation
 Klaeger, SGohlke, BPerrin, JGupta, VHeinzlmeir, SHelm, DQiao, HBergamini, GHanda, HSavitski, MMBantscheff, MMédard, GPreissner, RKuster, B Chemical Proteomics Reveals Ferrochelatase as a Common Off-target of Kinase Inhibitors. ACS Chem Biol 11:1245-54 (2016)  
Target
Name:
Ferrochelatase, mitochondrial [R115L]
Synonyms:
FECH HEMH_HUMAN
Type:
Protein
Mol. Mass.:
47832.73
Organism:
Homo sapiens (Human)
Description:
Mutant R115L used for experiment
Residue:
423
  
Inhibitor
Name:
BDBM50429701
Synonyms:
AZD-2014 US9102670, 1ap
Type:
Small organic molecule
Emp. Form.:
C25H30N6O3
Mol. Mass.:
462.5441
SMILES:
CNC(=O)c1cccc(c1)-c1ccc2c(nc(nc2n1)N1CCOC[C@@H]1C)N1CCOC[C@@H]1C
: