Target
Protein-glutamine gamma-glutamyltransferase 6
Ligand
BDBM185181
Substrate
Meas. Tech.
TG Activity Assays
IC50
5e+3±n/a nM
Citation
 Badarau, EWang, ZRathbone, DLCostanzi, AThibault, TMurdoch, CEEl Alaoui, SBartkeviciute, MGriffin, M Development of Potent and Selective Tissue Transglutaminase Inhibitors: Their Effect on TG2 Function and Application in Pathological Conditions. Chem Biol 22:1347-61 (2015)  
Target
Name:
Protein-glutamine gamma-glutamyltransferase 6
Synonyms:
Protein-glutamine gamma-glutamyltransferase 6 TGM3L TGM6 TGase Y TGase-6 Transglutaminase-3-like Transglutaminase-6 (TG6)
Type:
Protein
Mol. Mass.:
79319.01
Organism:
Homo sapiens (Human)
Description:
Residue:
706
  
Inhibitor
Name:
BDBM185181
Synonyms:
N-[2-[4-[[5-(dimethylamino)-1-naphthyl]sulfonyl]piperazin-1-yl]-2-oxo-ethyl]prop-2-enamide (3h)
Type:
Small organic molecule
Emp. Form.:
C21H26N4O4S
Mol. Mass.:
430.521
SMILES:
CN(C)c1cccc2c(cccc12)S(=O)(=O)N1CCN(CC1)C(=O)CNC(=O)C=C
: