Target
Protein-glutamine gamma-glutamyltransferase 6
Ligand
BDBM185173
Substrate
Meas. Tech.
TG Activity Assays
IC50
2e+3±n/a nM
Citation
 Badarau, EWang, ZRathbone, DLCostanzi, AThibault, TMurdoch, CEEl Alaoui, SBartkeviciute, MGriffin, M Development of Potent and Selective Tissue Transglutaminase Inhibitors: Their Effect on TG2 Function and Application in Pathological Conditions. Chem Biol 22:1347-61 (2015)  
Target
Name:
Protein-glutamine gamma-glutamyltransferase 6
Synonyms:
Protein-glutamine gamma-glutamyltransferase 6 TGM3L TGM6 TGase Y TGase-6 Transglutaminase-3-like Transglutaminase-6 (TG6)
Type:
Protein
Mol. Mass.:
79319.01
Organism:
Homo sapiens (Human)
Description:
Residue:
706
  
Inhibitor
Name:
BDBM185173
Synonyms:
N-[2-[4-(adamantane-1-carbonyl)piperazin-1-yl]-2-oxo-ethyl]prop-2-enamide (3e)
Type:
Small organic molecule
Emp. Form.:
C20H29N3O3
Mol. Mass.:
359.4626
SMILES:
C=CC(=O)NCC(=O)N1CCN(CC1)C(=O)C12CC3CC(CC(C3)C1)C2
: