Target
Transient receptor potential cation channel subfamily V member 1
Ligand
BDBM185344
Substrate
Meas. Tech.
pH-Based Assay
pH
7.4±n/a
IC50
60.8±n/a nM
Comments
extracted
Citation
 Kurose, NIso, YYamaguchi, NShao, BTafesse, LZhou, XYu, J Heterocyclic compounds US Patent  US9156830 Publication Date 10/13/2015 
Target
Name:
Transient receptor potential cation channel subfamily V member 1
Synonyms:
Capsaicin receptor Osm-9-like TRP channel 1 TRPV1_HUMAN Transient receptor potential cation channel subfamily V member 1 (TRPV1) Transient receptor potential cation channel subfamily V member 1(TRPV1) Vanilloid VR1 Vanilloid receptor 1 Vanilloid receptor 1 (VRI/TRPV1)
Type:
Protein
Mol. Mass.:
94960.75
Organism:
Homo sapiens (Human)
Description:
Q8NER1
Residue:
839
  
Inhibitor
Name:
BDBM185344
Synonyms:
US9156830, I-50
Type:
Small organic molecule
Emp. Form.:
C22H18Cl2F3N5O3
Mol. Mass.:
528.311
SMILES:
OCCc1nnc(o1)-c1cnc(C2=CCN(CC2)C(=O)Nc2ccc(c(Cl)c2)C(F)(F)F)c(Cl)c1
: