Target
Leucine-rich repeat serine/threonine-protein kinase 2
Ligand
BDBM185392
Substrate
Meas. Tech.
Lantha Screen Technology Assay
pH
7.5±n/a
IC50
43±n/a nM
Comments
extracted
Citation
 Galatsis, PHayward, MMKormos, BLWager, TTZhang, LStepan, AFHenderson, JLKurumbail, RGVerhoest, PR 4-(substituted amino)-7H-pyrrolo[2,3-d] pyrimidines as LRRK2 inhibitors US Patent  US9156845 Publication Date 10/13/2015 
Target
Name:
Leucine-rich repeat serine/threonine-protein kinase 2
Synonyms:
Dardarin LRRK2_HUMAN Leucine-rich repeat serine/threonine-protein kinase 2 PARK8
Type:
Protein
Mol. Mass.:
286113.20
Organism:
Homo sapiens (Human)
Description:
Q5S007
Residue:
2527
  
Inhibitor
Name:
BDBM185392
Synonyms:
US9156845, 36 | US9156845, 76
Type:
Small organic molecule
Emp. Form.:
C20H17N7O
Mol. Mass.:
371.3953
SMILES:
N#Cc1cccc(c1)-c1c[nH]c2ncnc(N3CCOC(C3)c3cc[nH]n3)c12
: