Target
D(2) dopamine receptor
Ligand
BDBM50395578
Substrate
Meas. Tech.
Beta-Arrestin Recruitment (Tango) Assay
pH
7.4±n/a
EC50
82±n/a nM
Comments
extracted
Citation
 Jin, JRoth, BFrye, S Functionally selective ligands of dopamine D2 receptors US Patent  US9156822 Publication Date 10/13/2015 
Target
Name:
D(2) dopamine receptor
Synonyms:
D(2) dopamine receptor DOPAMINE D2 Long DRD2 Dopamine D2 receptor Dopamine D2 receptor (D2R) Dopamine2-like | d2
Type:
Cell-surface receptors
Mol. Mass.:
50647.10
Organism:
Homo sapiens (Human)
Description:
P14416
Residue:
443
  
Inhibitor
Name:
BDBM50395578
Synonyms:
CHEMBL2165137 US9156822, 21
Type:
Small organic molecule
Emp. Form.:
C22H24Cl2N2OS
Mol. Mass.:
435.41
SMILES:
Clc1cccc(C2CCN(CCCCOc3ccc4scnc4c3)CC2)c1Cl
: