Target
Non-receptor tyrosine-protein kinase TYK2
Ligand
BDBM185700
Substrate
Meas. Tech.
Enzymatic Assay
pH
7.4±n/a
IC50
75.1±n/a nM
Comments
extracted
Citation
 Mitton-Fry, MJBerlinski, PJBirchmeier, MJBowman, JWGonzales, AJKamerling, SGMann, DW Pyrrolo[2,3-d]pyrimidine compounds US Patent  US9161939 Publication Date 10/20/2015 
Target
Name:
Non-receptor tyrosine-protein kinase TYK2
Synonyms:
Non-receptor tyrosine-protein kinase TYK2 (TYK2) TYK2_HUMAN | Tyrosine-protein kinase TYK2
Type:
Protein
Mol. Mass.:
133666.03
Organism:
Homo sapiens (Human)
Description:
P29597
Residue:
1187
  
Inhibitor
Name:
BDBM185700
Synonyms:
US10875847, Compound Oclacitinib US9271981, 1a
Type:
Small organic molecule
Emp. Form.:
C15H23N5O2S
Mol. Mass.:
337.44
SMILES:
CNS(=O)(=O)C[C@H]1CC[C@@H](CC1)N(C)c1ncnc2[nH]ccc12
: