Target
Protein-glutamine gamma-glutamyltransferase 2
Ligand
BDBM185768
Substrate
Meas. Tech.
Enzyme Inhibition Assay
IC50
24000±5000 nM
Citation
 Pardin, CKeillor, JWLubell, WD Cinnamoyl inhibitors of transglutaminase US Patent  US9162991 Publication Date 10/20/2015 
Target
Name:
Protein-glutamine gamma-glutamyltransferase 2
Synonyms:
TGM2 Transglutaminases (TGase)
Type:
Enzyme
Mol. Mass.:
77122.36
Organism:
Cavia cutleri (Guinea pig)
Description:
P08587
Residue:
690
  
Inhibitor
Name:
BDBM185768
Synonyms:
US9162991, 14b
Type:
Small organic molecule
Emp. Form.:
C15H10N4O4
Mol. Mass.:
310.2643
SMILES:
[O-]n1n[n+](C(=O)\C=C\c2cccc(c2)N(=O)=O)c2ccccc12
: