Target
Protein-glutamine gamma-glutamyltransferase 2
Ligand
BDBM185770
Substrate
Meas. Tech.
Enzyme Inhibition Assay
IC50
41000±9000 nM
Citation
 Pardin, CKeillor, JWLubell, WD Cinnamoyl inhibitors of transglutaminase US Patent  US9162991 Publication Date 10/20/2015 
Target
Name:
Protein-glutamine gamma-glutamyltransferase 2
Synonyms:
TGM2 Transglutaminases (TGase)
Type:
Enzyme
Mol. Mass.:
77122.36
Organism:
Cavia cutleri (Guinea pig)
Description:
P08587
Residue:
690
  
Inhibitor
Name:
BDBM185770
Synonyms:
US9162991, 14l
Type:
Small organic molecule
Emp. Form.:
C15H10ClN3O2
Mol. Mass.:
299.712
SMILES:
[O-]n1n[n+](C(=O)\C=C\c2cccc(Cl)c2)c2ccccc12
: