Target
Protein-glutamine gamma-glutamyltransferase 2
Ligand
BDBM185778
Substrate
Meas. Tech.
Enzyme Inhibition Assay
IC50
>100000±n/a nM
Citation
 Pardin, CKeillor, JWLubell, WD Cinnamoyl inhibitors of transglutaminase US Patent  US9162991 Publication Date 10/20/2015 
Target
Name:
Protein-glutamine gamma-glutamyltransferase 2
Synonyms:
TGM2 Transglutaminases (TGase)
Type:
Enzyme
Mol. Mass.:
77122.36
Organism:
Cavia cutleri (Guinea pig)
Description:
P08587
Residue:
690
  
Inhibitor
Name:
BDBM185778
Synonyms:
US9162991, 15j
Type:
Small organic molecule
Emp. Form.:
C15H11N3O
Mol. Mass.:
249.2673
SMILES:
O=C(\C=C\c1ccccc1)n1nnc2ccccc12
: