Target
Protein-glutamine gamma-glutamyltransferase 2
Ligand
BDBM185780
Substrate
Meas. Tech.
Enzyme Inhibition Assay
IC50
>100000±n/a nM
Citation
 Pardin, CKeillor, JWLubell, WD Cinnamoyl inhibitors of transglutaminase US Patent  US9162991 Publication Date 10/20/2015 
Target
Name:
Protein-glutamine gamma-glutamyltransferase 2
Synonyms:
TGM2 Transglutaminases (TGase)
Type:
Enzyme
Mol. Mass.:
77122.36
Organism:
Cavia cutleri (Guinea pig)
Description:
P08587
Residue:
690
  
Inhibitor
Name:
BDBM185780
Synonyms:
US9162991, 15m
Type:
Small organic molecule
Emp. Form.:
C15H10ClN3O
Mol. Mass.:
283.712
SMILES:
Clc1ccccc1\C=C\C(=O)n1nnc2ccccc12
: