Target
Protein-glutamine gamma-glutamyltransferase 2
Ligand
BDBM185787
Substrate
Meas. Tech.
Enzyme Inhibition Assay
IC50
28000±4000 nM
Citation
 Pardin, CKeillor, JWLubell, WD Cinnamoyl inhibitors of transglutaminase US Patent  US9162991 Publication Date 10/20/2015 
Target
Name:
Protein-glutamine gamma-glutamyltransferase 2
Synonyms:
TGM2 Transglutaminases (TGase)
Type:
Enzyme
Mol. Mass.:
77122.36
Organism:
Cavia cutleri (Guinea pig)
Description:
P08587
Residue:
690
  
Inhibitor
Name:
BDBM185787
Synonyms:
US9162991, 30t
Type:
Small organic molecule
Emp. Form.:
C16H14N2O2
Mol. Mass.:
266.2946
SMILES:
CC(=O)Nc1ccc(\C=C\C(=O)c2cccnc2)cc1
: