Target
Protein-glutamine gamma-glutamyltransferase 2
Ligand
BDBM185791
Substrate
Meas. Tech.
Enzyme Inhibition Assay
IC50
>200000±n/a nM
Citation
 Pardin, CKeillor, JWLubell, WD Cinnamoyl inhibitors of transglutaminase US Patent  US9162991 Publication Date 10/20/2015 
Target
Name:
Protein-glutamine gamma-glutamyltransferase 2
Synonyms:
TGM2 Transglutaminases (TGase)
Type:
Enzyme
Mol. Mass.:
77122.36
Organism:
Cavia cutleri (Guinea pig)
Description:
P08587
Residue:
690
  
Inhibitor
Name:
BDBM185791
Synonyms:
US9162991, 37a
Type:
Small organic molecule
Emp. Form.:
C17H12N4O3
Mol. Mass.:
320.3022
SMILES:
O=C(\C=C\C=C\c1ccc(cc1)N(=O)=O)n1nnc2ccccc12
: