Target
Protein-glutamine gamma-glutamyltransferase 2
Ligand
BDBM185741
Substrate
Meas. Tech.
Enzyme Inhibition Assay
IC50
>20000±n/a nM
Citation
 Pardin, CKeillor, JWLubell, WD Cinnamoyl inhibitors of transglutaminase US Patent  US9162991 Publication Date 10/20/2015 
Target
Name:
Protein-glutamine gamma-glutamyltransferase 2
Synonyms:
TGM2 Transglutaminases (TGase)
Type:
Enzyme
Mol. Mass.:
77122.36
Organism:
Cavia cutleri (Guinea pig)
Description:
P08587
Residue:
690
  
Inhibitor
Name:
BDBM185741
Synonyms:
US9162991, 16a
Type:
Small organic molecule
Emp. Form.:
C14H9N5O4
Mol. Mass.:
311.2524
SMILES:
[O-]n1n[n+](C(=O)\C=C\c2ccc(cc2)[N+]([O-])=O)c2cccnc12
: