Target
Protein-glutamine gamma-glutamyltransferase 2
Ligand
BDBM185742
Substrate
Meas. Tech.
Enzyme Inhibition Assay
IC50
>20000±n/a nM
Citation
 Pardin, CKeillor, JWLubell, WD Cinnamoyl inhibitors of transglutaminase US Patent  US9162991 Publication Date 10/20/2015 
Target
Name:
Protein-glutamine gamma-glutamyltransferase 2
Synonyms:
TGM2 Transglutaminases (TGase)
Type:
Enzyme
Mol. Mass.:
77122.36
Organism:
Cavia cutleri (Guinea pig)
Description:
P08587
Residue:
690
  
Inhibitor
Name:
BDBM185742
Synonyms:
US9162991, 18a
Type:
Small organic molecule
Emp. Form.:
C12H9N3O3
Mol. Mass.:
243.2182
SMILES:
[O-][N+](=O)c1ccc(\C=C\C(=O)n2ccnc2)cc1
: