Target
Protein-glutamine gamma-glutamyltransferase 2
Ligand
BDBM185753
Substrate
Meas. Tech.
Enzyme Inhibition Assay
IC50
>200000±n/a nM
Citation
 Pardin, CKeillor, JWLubell, WD Cinnamoyl inhibitors of transglutaminase US Patent  US9162991 Publication Date 10/20/2015 
Target
Name:
Protein-glutamine gamma-glutamyltransferase 2
Synonyms:
TGM2 Transglutaminases (TGase)
Type:
Enzyme
Mol. Mass.:
77122.36
Organism:
Cavia cutleri (Guinea pig)
Description:
P08587
Residue:
690
  
Inhibitor
Name:
BDBM185753
Synonyms:
US9162991, 29a
Type:
Small organic molecule
Emp. Form.:
C13H14N2O4
Mol. Mass.:
262.2613
SMILES:
[O-][N+](=O)c1ccc(\C=C\C(=O)N2CCCOC2)cc1
: