Target
Protein-glutamine gamma-glutamyltransferase 2
Ligand
BDBM185759
Substrate
Meas. Tech.
Enzyme Inhibition Assay
IC50
14000±2100 nM
Citation
 Pardin, CKeillor, JWLubell, WD Cinnamoyl inhibitors of transglutaminase US Patent  US9162991 Publication Date 10/20/2015 
Target
Name:
Protein-glutamine gamma-glutamyltransferase 2
Synonyms:
TGM2 Transglutaminases (TGase)
Type:
Enzyme
Mol. Mass.:
77122.36
Organism:
Cavia cutleri (Guinea pig)
Description:
P08587
Residue:
690
  
Inhibitor
Name:
BDBM185759
Synonyms:
US9162991, 4n
Type:
Small organic molecule
Emp. Form.:
C19H16N4O4
Mol. Mass.:
364.3547
SMILES:
COc1ccc(Cn2cc(nn2)C(=O)\C=C\c2ccc(cc2)N(=O)=O)cc1
: