Target
Protein-glutamine gamma-glutamyltransferase 2
Ligand
BDBM185760
Substrate
Meas. Tech.
Enzyme Inhibition Assay
IC50
18000±1700 nM
Citation
 Pardin, CKeillor, JWLubell, WD Cinnamoyl inhibitors of transglutaminase US Patent  US9162991 Publication Date 10/20/2015 
Target
Name:
Protein-glutamine gamma-glutamyltransferase 2
Synonyms:
TGM2 Transglutaminases (TGase)
Type:
Enzyme
Mol. Mass.:
77122.36
Organism:
Cavia cutleri (Guinea pig)
Description:
P08587
Residue:
690
  
Inhibitor
Name:
BDBM185760
Synonyms:
US9162991, 4e
Type:
Small organic molecule
Emp. Form.:
C17H13N5O3
Mol. Mass.:
335.3168
SMILES:
O=C(\C=C\c1ccc(cc1)N(=O)=O)c1cn(Cc2ccccn2)nn1
: