Target
Protein-glutamine gamma-glutamyltransferase 2
Ligand
BDBM185766
Substrate
Meas. Tech.
Enzyme Inhibition Assay
IC50
>100000±n/a nM
Citation
 Pardin, CKeillor, JWLubell, WD Cinnamoyl inhibitors of transglutaminase US Patent  US9162991 Publication Date 10/20/2015 
Target
Name:
Protein-glutamine gamma-glutamyltransferase 2
Synonyms:
TGM2 Transglutaminases (TGase)
Type:
Enzyme
Mol. Mass.:
77122.36
Organism:
Cavia cutleri (Guinea pig)
Description:
P08587
Residue:
690
  
Inhibitor
Name:
BDBM185766
Synonyms:
US9162991, 4l
Type:
Small organic molecule
Emp. Form.:
C24H18N4O3
Mol. Mass.:
410.4247
SMILES:
O=C(\C=C\c1ccc(cc1)N(=O)=O)c1cn(nn1)C(c1ccccc1)c1ccccc1
: