Target
Sodium channel protein type 9 subunit alpha
Ligand
BDBM185975
Substrate
Meas. Tech.
FLIPR Assay
IC50
180±n/a nM
Citation
 Ni, CShao, BTafesse, LYao, JYoungman, MPark, M Pyrimidines as sodium channel blockers US Patent  US9163008 Publication Date 10/20/2015 
Target
Name:
Sodium channel protein type 9 subunit alpha
Synonyms:
NENA Peripheral sodium channel 1 SCN9A_HUMAN Voltage-gated sodium channel subunit Nav1.7 hNE-Na
Type:
Protein
Mol. Mass.:
226375.97
Organism:
Homo sapiens (Human)
Description:
Q15858
Residue:
1988
  
Inhibitor
Name:
BDBM185975
Synonyms:
US9163008, 64 | US9656968, Compound 64
Type:
Small organic molecule
Emp. Form.:
C20H17ClFN5O3
Mol. Mass.:
429.832
SMILES:
C[C@H](Nc1cc(nc(n1)-c1ccc(Oc2ccc(Cl)cc2F)cc1)C(N)=O)C(N)=O
: