Target
Beta-secretase 1
Ligand
BDBM186064
Substrate
Meas. Tech.
Inhibition Assay
pH
4.5±n/a
Temperature
298.15±n/a K
IC50
330±n/a nM
Comments
extracted
Citation
 Lueoend, RMMachauer, RRueeger, HVeenstra, SJ Oxazine derivatives and their use in the treatment of disease US Patent  US9163011 Publication Date 10/20/2015 
Target
Name:
Beta-secretase 1
Synonyms:
ASP2 Aspartyl protease 2 BACE1 Beta-secretase (BACE) Beta-secretase 1 (BACE 1) Beta-secretase 1 (BACE1) Beta-site amyloid precursor protein cleaving enzyme 1 Memapsin-2 beta-Secretase (BACE-1) | beta-Secretase (BACE1)
Type:
Protein
Mol. Mass.:
55755.10
Organism:
Homo sapiens (Human)
Description:
P56817
Residue:
501
  
Inhibitor
Name:
BDBM186064
Synonyms:
US9163011, 18
Type:
Small organic molecule
Emp. Form.:
C16H14F4N6O2
Mol. Mass.:
398.315
SMILES:
C[C@@]1(N=C(N)OCC1(F)F)c1nc(NC(=O)c2ncc(F)cc2N)ccc1F
: