Target
Phosphatidylinositol 4-phosphate 3-kinase C2 domain-containing subunit beta
Ligand
BDBM288377
Substrate
Meas. Tech.
KINOMEscan Enzyme Binding Assays
Kd
1.90±n/a nM
Citation
 Mevellec, LAMeerpoel, LCoupa, SPoncelet, VSPilatte, INPasquier, ETBerthelot, DJQuerolle, OAMeyer, CAngibaud, PRDemestre, CGMercey, GJ Imidazopyridazine derivatives as PI3KB inhibitors US Patent  US10087187 Publication Date 10/2/2018 
Target
Name:
Phosphatidylinositol 4-phosphate 3-kinase C2 domain-containing subunit beta
Synonyms:
C2-PI3K PI3K-C2beta Phosphatidylinositol 4-phosphate 3-kinase C2 beta (PIK3C2B) Phosphoinositide 3-Kinase (PI3K), C2beta PtdIns-3-kinase C2 beta
Type:
Enzyme
Mol. Mass.:
184784.86
Organism:
Homo sapiens (Human)
Description:
O00750
Residue:
1634
  
Inhibitor
Name:
BDBM288377
Synonyms:
US10087187, Compound 68
Type:
Small organic molecule
Emp. Form.:
C23H24F3N7O3
Mol. Mass.:
503.477
SMILES:
Cc1c(Nc2c(CO)nc3c(cc(nn23)N2CCOC(CO)C2)-c2c[nH]cn2)cccc1C(F)(F)F
: