Target
D(4) dopamine receptor
Ligand
BDBM186945
Substrate
Meas. Tech.
Radioligand Binding Assay
pH
7.4±n/a
Ki
4947±n/a nM
Comments
extracted
Citation
 Besnard, JHopkins, ALGilbert, IRuda, GFAbecassis, K Morpholino compounds, uses and methods US Patent  US9079895 Publication Date 7/14/2015 
Target
Name:
D(4) dopamine receptor
Synonyms:
DRD4_MOUSE Drd4
Type:
Enzyme
Mol. Mass.:
41498.73
Organism:
Mus musculus (Mouse)
Description:
P51436
Residue:
387
  
Inhibitor
Name:
BDBM186945
Synonyms:
US9079895, 29r
Type:
Small organic molecule
Emp. Form.:
C22H29N3O2
Mol. Mass.:
367.4846
SMILES:
Cc1ccnc(C)c1OC[C@H]1CN(CCN2CCc3ccccc23)CCO1
: