Target
Interleukin-1 receptor-associated kinase 4
Ligand
BDBM187812
Substrate
Meas. Tech.
Inhibition Assay
pH
7.2±n/a
IC50
2.4±n/a nM
Citation
 Santella, JBKumar, SRDuncia, JVGardner, DSPaidi, VRNair, SKHynes, JWu, HMurugesan, NSarkunam, KArunachalam, P Heteroaryl substituted nicotinamide compounds US Patent  US9169252 Publication Date 10/27/2015 
Target
Name:
Interleukin-1 receptor-associated kinase 4
Synonyms:
IRAK-4 IRAK4_HUMAN Interleukin-1 receptor-associated kinase 4 (IRAK4) | Renal carcinoma antigen NY-REN-64
Type:
Protein
Mol. Mass.:
51519.08
Organism:
Homo sapiens (Human)
Description:
Q9NWZ3
Residue:
460
  
Inhibitor
Name:
BDBM187812
Synonyms:
US9169252, 355
Type:
Small organic molecule
Emp. Form.:
C23H24FN9O2
Mol. Mass.:
477.4942
SMILES:
CCn1cc(Nc2cc(ncc2C(=O)NC[C@@H](F)C(C)(C)O)-n2ncc3cc(cnc23)C#N)cn1
: