Target
Interleukin-1 receptor-associated kinase 4
Ligand
BDBM187846
Substrate
Meas. Tech.
Inhibition Assay
pH
7.2±n/a
IC50
4±n/a nM
Citation
 Santella, JBKumar, SRDuncia, JVGardner, DSPaidi, VRNair, SKHynes, JWu, HMurugesan, NSarkunam, KArunachalam, P Heteroaryl substituted nicotinamide compounds US Patent  US9169252 Publication Date 10/27/2015 
Target
Name:
Interleukin-1 receptor-associated kinase 4
Synonyms:
IRAK-4 IRAK4_HUMAN Interleukin-1 receptor-associated kinase 4 (IRAK4) | Renal carcinoma antigen NY-REN-64
Type:
Protein
Mol. Mass.:
51519.08
Organism:
Homo sapiens (Human)
Description:
Q9NWZ3
Residue:
460
  
Inhibitor
Name:
BDBM187846
Synonyms:
US9169252, 389
Type:
Small organic molecule
Emp. Form.:
C21H19F2N9O
Mol. Mass.:
451.4321
SMILES:
CCCNC(=O)c1cnc(cc1Nc1cnn(CC(F)F)c1)-n1ncc2cc(cnc12)C#N
: