Target
CREB-binding protein
Ligand
BDBM188518
Substrate
Meas. Tech.
CBP Fluorescence Resonance Energy Transfer (FRET)
IC50
1.06e+4±n/a nM
Citation
 Chekler, ELPellegrino, JALanz, TADenny, RAFlick, ACCoe, JLangille, JBasak, ALiu, SStock, IASahasrabudhe, PBonin, PDLee, KPletcher, MTJones, LH Transcriptional Profiling of a Selective CREB Binding Protein Bromodomain Inhibitor Highlights Therapeutic Opportunities. Chem Biol 22:1588-96 (2015)  
Target
Name:
CREB-binding protein
Synonyms:
CBP CREB-binding protein (CBP) CREBBP
Type:
Transcription Coactivator
Mol. Mass.:
265411.66
Organism:
Homo sapiens (Human)
Description:
Q92793
Residue:
2442
  
Inhibitor
Name:
BDBM188518
Synonyms:
ISOX-INACT
Type:
Small organic molecule
Emp. Form.:
C29H36N4O3
Mol. Mass.:
488.6211
SMILES:
COc1ccc(CCc2nc3c(C)c(-c4c(C)noc4C)c(C)cc3n2CCN2CCOCC2)cc1
: