Target
CREB-binding protein
Ligand
BDBM188519
Substrate
Meas. Tech.
ITC
Kd
21±n/a nM
Citation
 Chekler, ELPellegrino, JALanz, TADenny, RAFlick, ACCoe, JLangille, JBasak, ALiu, SStock, IASahasrabudhe, PBonin, PDLee, KPletcher, MTJones, LH Transcriptional Profiling of a Selective CREB Binding Protein Bromodomain Inhibitor Highlights Therapeutic Opportunities. Chem Biol 22:1588-96 (2015)  
Target
Name:
CREB-binding protein
Synonyms:
CBP CREB-binding protein (CBP) CREBBP
Type:
Transcription Coactivator
Mol. Mass.:
265411.66
Organism:
Homo sapiens (Human)
Description:
Q92793
Residue:
2442
  
Inhibitor
Name:
BDBM188519
Synonyms:
SGC-CBP30
Type:
Small organic molecule
Emp. Form.:
C28H33ClN4O3
Mol. Mass.:
509.04
SMILES:
COc1ccc(CCc2nc3cc(ccc3n2C[C@H](C)N2CCOCC2)-c2c(C)noc2C)cc1Cl
: