Target
Bromodomain-containing protein 4
Ligand
BDBM188520
Substrate
Meas. Tech.
BRD4 Fluorescence Polarization (FP)
IC50
1.5e+3±n/a nM
Citation
 Chekler, ELPellegrino, JALanz, TADenny, RAFlick, ACCoe, JLangille, JBasak, ALiu, SStock, IASahasrabudhe, PBonin, PDLee, KPletcher, MTJones, LH Transcriptional Profiling of a Selective CREB Binding Protein Bromodomain Inhibitor Highlights Therapeutic Opportunities. Chem Biol 22:1588-96 (2015)  
Target
Name:
Bromodomain-containing protein 4
Synonyms:
BRD4 Bromodomain-containing protein 4 (BRD4) Protein HUNK1
Type:
Protein
Mol. Mass.:
152264.84
Organism:
Homo sapiens (Human)
Description:
O60885
Residue:
1362
  
Inhibitor
Name:
BDBM188520
Synonyms:
ISOX-DUAL
Type:
Small organic molecule
Emp. Form.:
C31H41N5O3
Mol. Mass.:
531.6889
SMILES:
CN(C)CCCOc1ccc(CCc2nc3cc(ccc3n2CCN2CCOCC2)-c2c(C)noc2C)cc1
: