Target
Histone deacetylase 4
Ligand
BDBM49152
Substrate
Meas. Tech.
HDAC Enzymatic Assay
pH
7.4±n/a
IC50
1.38e+4±n/a nM
Comments
extracted
Citation
 Boskovic, ZVKemp, MMFreedy, AMViswanathan, VSPop, MSFuller, JHMartinez, NMFigueroa Lazú, SOHong, JALewis, TACalarese, DLove, JDVetere, AAlmo, SCSchreiber, SLKoehler, AN Inhibition of Zinc-Dependent Histone Deacetylases with a Chemically Triggered Electrophile. ACS Chem Biol 11:1844-51 (2016)  
Target
Name:
Histone deacetylase 4
Synonyms:
Cereblon/Histone deacetylase 4 HDAC4 Histone acetylase 4(HDAC4) KIAA0288
Type:
Enzyme
Mol. Mass.:
119049.39
Organism:
Homo sapiens (Human)
Description:
P56524
Residue:
1084
  
Inhibitor
Name:
BDBM49152
Synonyms:
5-chloranyl-7-[(4-ethylpiperazin-1-yl)-pyridin-3-yl-methyl]quinolin-8-ol 5-chloro-7-[(4-ethylpiperazin-1-yl)-pyridin-3-ylmethyl]quinolin-8-ol BRD4354 SMR000151966 | cid_3516032
Type:
Small organic molecule
Emp. Form.:
C21H23ClN4O
Mol. Mass.:
382.887
SMILES:
CCN1CCN(CC1)C(c1cccnc1)c1cc(Cl)c2cccnc2c1O
: