Target
Coagulation factor VII
Ligand
BDBM189440
Substrate
Meas. Tech.
In Vitro Assay
pH
7.4±n/a
Ki
270±n/a nM
Comments
extracted
Citation
 Zhang, XGlunz, PPriestley, ESJohnson, JAWurtz, NRLadziata, V Macrocyclic factor VIIa inhibitors US Patent  US9174974 Publication Date 11/3/2015 
Target
Name:
Coagulation factor VII
Synonyms:
Eptacog alfa FA7_HUMAN Factor VIIa (fVIIa) SPCA serum prothrombin conversion accelerator
Type:
Enzyme
Mol. Mass.:
51599.89
Organism:
Homo sapiens (Human)
Description:
Residue:
466
  
Inhibitor
Name:
BDBM189440
Synonyms:
US9174974, Example 25
Type:
Small organic molecule
Emp. Form.:
C33H33F2N5O6S
Mol. Mass.:
665.707
SMILES:
COc1cc2[C@@H](Nc3cc4ccnc(N)c4cc3F)C(=O)N(C)Cc3cc(NC(=O)OC[C@H](C)c1cc2F)ccc3S(=O)(=O)C1CC1
: