Target
Histone-lysine N-methyltransferase EZH2 [Y641F]
Ligand
BDBM190204
Substrate
Meas. Tech.
Inhibition Assay
IC50
1.4±n/a nM
Citation
 Kuntz, KWKnutson, SKWigle, TJ Inhibitors of human EZH2, and methods of use thereof US Patent  US9175331 Publication Date 11/3/2015 
Target
Name:
Histone-lysine N-methyltransferase EZH2 [Y641F]
Synonyms:
EZH2 EZH2_HUMAN KMT6
Type:
Mol. Mass.:
85351.84
Organism:
Homo sapiens (Human)
Description:
Q15910[Y641F]
Residue:
746
  
Inhibitor
Name:
BDBM190204
Synonyms:
EPZ008491 | US9175331, 35
Type:
Small organic molecule
Emp. Form.:
C30H43N5O3
Mol. Mass.:
521.6941
SMILES:
CCN([C@H]1CC[C@@H](CC1)N(C)C)c1cc(cc(C(=O)NCc2c(C)cc(C)[nH]c2=O)c1C)C(=O)N1CCC1
: