Target
Prostaglandin E2 receptor EP4 subtype
Ligand
BDBM190268
Substrate
Meas. Tech.
Radioligand Binding Assay
pH
6±n/a
Ki
0.49±n/a nM
IC50
1.3±n/a nM
Comments
extracted
Citation
 Barrett, SDCiske, FLColombo, JMEndres, GWGermain, BDKornilov, AKramer, JBUzieblo, AMaxey, KM Difluorolactam compounds as EP4 receptor-selective agonists for use in the treatment of EP4-mediated diseases and conditions US Patent  US9180116 Publication Date 11/10/2015 
Target
Name:
Prostaglandin E2 receptor EP4 subtype
Synonyms:
PE2R4_HUMAN PGE2 receptor EP4 subtype PTGER4 Prostanoid EP4 receptor
Type:
Enzyme
Mol. Mass.:
53134.53
Organism:
Homo sapiens (Human)
Description:
P35408
Residue:
488
  
Inhibitor
Name:
BDBM190268
Synonyms:
US9180116, 2C
Type:
Small organic molecule
Emp. Form.:
C21H31F2NO4
Mol. Mass.:
399.4719
SMILES:
CCC#CC[C@H](C)[C@H](O)\C=C\[C@H]1CC(F)(F)C(=O)N1CCCCCCC(O)=O
: