Target
Prostaglandin E2 receptor EP4 subtype
Ligand
BDBM190271
Substrate
Meas. Tech.
Radioligand Binding Assay
pH
6±n/a
Ki
1.8±n/a nM
IC50
4.9±n/a nM
Comments
extracted
Citation
 Barrett, SDCiske, FLColombo, JMEndres, GWGermain, BDKornilov, AKramer, JBUzieblo, AMaxey, KM Difluorolactam compounds as EP4 receptor-selective agonists for use in the treatment of EP4-mediated diseases and conditions US Patent  US9180116 Publication Date 11/10/2015 
Target
Name:
Prostaglandin E2 receptor EP4 subtype
Synonyms:
PE2R4_HUMAN PGE2 receptor EP4 subtype PTGER4 Prostanoid EP4 receptor
Type:
Enzyme
Mol. Mass.:
53134.53
Organism:
Homo sapiens (Human)
Description:
P35408
Residue:
488
  
Inhibitor
Name:
BDBM190271
Synonyms:
US9180116, 10C
Type:
Small organic molecule
Emp. Form.:
C24H33F2NO4
Mol. Mass.:
437.5199
SMILES:
O[C@@H](CCCCc1ccccc1)\C=C\[C@H]1CC(F)(F)C(=O)N1CCCCCCC(O)=O
: