Target
Vasopressin V1a receptor
Ligand
BDBM190349
Substrate
Meas. Tech.
Cellular in Vitro Assay
IC50
4±n/a nM
Citation
 Fürstner, CKeldenich, JDelbeck, MKolkhof, PKretschmer, APook, ESchmeck, CTrübel, H Substituted N-phenethyltriazoloneacetamides and use thereof US Patent  US9180120 Publication Date 11/10/2015 
Target
Name:
Vasopressin V1a receptor
Synonyms:
AVPR V1a AVPR1A V1AR_HUMAN VASOPRESSIN V1A Vasopressin V1 receptor Vasopressin receptor
Type:
Receptor
Mol. Mass.:
46820.18
Organism:
Homo sapiens (Human)
Description:
P37288
Residue:
418
  
Inhibitor
Name:
BDBM190349
Synonyms:
US9180120, 53
Type:
Small organic molecule
Emp. Form.:
C23H21ClF6N4O4
Mol. Mass.:
566.881
SMILES:
OC[C@@H](Cc1cccc(c1)C(F)(F)F)NC(=O)Cn1nc(-c2ccc(Cl)cc2)n(C[C@H](O)C(F)(F)F)c1=O
: