Target
Prostaglandin E2 receptor EP1 subtype
Ligand
BDBM190563
Substrate
Meas. Tech.
Inhibition Assay
Temperature
310.15±n/a K
IC50
6.9±n/a nM
Comments
extracted
Citation
 Maruyama, TOkada, HKonemura, T Therapeutic agent for urinary excretion disorder US Patent  US9181187 Publication Date 11/10/2015 
Target
Name:
Prostaglandin E2 receptor EP1 subtype
Synonyms:
PE2R1_MOUSE Prostaglandin E1 Prostanoid EP1 receptor Ptgerep1
Type:
G-protein coupled receptor
Mol. Mass.:
43000.62
Organism:
Mus musculus (Mouse)
Description:
Residue:
405
  
Inhibitor
Name:
BDBM190563
Synonyms:
US9181187, Compound A
Type:
Small organic molecule
Emp. Form.:
C25H28N2O5S2
Mol. Mass.:
500.63
SMILES:
CC(C)CN(c1cc2CCCc2cc1OCc1ccc(cc1C)C(O)=O)S(=O)(=O)c1nccs1
: