Target
Transient receptor potential cation channel subfamily V member 3
Ligand
BDBM190576
Substrate
Meas. Tech.
Inhibition Assay
IC50
<200±n/a nM
Citation
 Moran, MMChong, JAFanger, CRipka, ASLarsen, GRZhen, XUnderwood, DJWeigele, M Compounds of modulating TRPV3 function US Patent  US9181219 Publication Date 11/10/2015 
Target
Name:
Transient receptor potential cation channel subfamily V member 3
Synonyms:
TRPV3 Transient receptor potential cation channel subfamily V member 3 (TRPV3) | Vanilloid receptor-like 3
Type:
Enzyme
Mol. Mass.:
90635.51
Organism:
Homo sapiens (Human)
Description:
Q8NET8
Residue:
790
  
Inhibitor
Name:
BDBM190576
Synonyms:
US9181219, 6
Type:
Small organic molecule
Emp. Form.:
C18H17F3N2OS
Mol. Mass.:
366.401
SMILES:
Cc1cccc2CCCN(C(=O)CSc3ccc(cn3)C(F)(F)F)c12
: