Target
Trace amine-associated receptor 1
Ligand
BDBM190608
Substrate
Meas. Tech.
Radioligand Binding Assay
pH
7.4±n/a
Temperature
310.15±n/a K
Ki
0.8±n/a nM
Comments
extracted
Citation
 Galley, GGoergler, ANorcross, RPflieger, P Morpholine compounds and uses thereof US Patent  US9181230 Publication Date 11/10/2015 
Target
Name:
Trace amine-associated receptor 1
Synonyms:
TAAR1_MOUSE Taar1 Trace amine receptor 1 (TARR1) Trace amine-associated receptor1 | Trar1
Type:
Protein
Mol. Mass.:
37635.41
Organism:
Mus musculus (Mouse)
Description:
Q923Y8
Residue:
332
  
Inhibitor
Name:
BDBM190608
Synonyms:
US9181230, 14
Type:
Small organic molecule
Emp. Form.:
C19H17F2N3O
Mol. Mass.:
341.3546
SMILES:
Fc1ccc(-c2cc(n[nH]2)-c2ccc(cc2)[C@@H]2CNCCO2)c(F)c1
: