Target
Trace amine-associated receptor 1
Ligand
BDBM190636
Substrate
Meas. Tech.
Radioligand Binding Assay
pH
7.4±n/a
Temperature
310.15±n/a K
Ki
1.6±n/a nM
Comments
extracted
Citation
 Galley, GGoergler, ANorcross, RPflieger, P Morpholine compounds and uses thereof US Patent  US9181230 Publication Date 11/10/2015 
Target
Name:
Trace amine-associated receptor 1
Synonyms:
TAAR1_MOUSE Taar1 Trace amine receptor 1 (TARR1) Trace amine-associated receptor1 | Trar1
Type:
Protein
Mol. Mass.:
37635.41
Organism:
Mus musculus (Mouse)
Description:
Q923Y8
Residue:
332
  
Inhibitor
Name:
BDBM190636
Synonyms:
US9181230, 42
Type:
Small organic molecule
Emp. Form.:
C18H17ClN4O
Mol. Mass.:
340.807
SMILES:
Clc1cc(ccn1)-c1cc(n[nH]1)-c1ccc(cc1)[C@H]1CNCCO1
: