Target
Trace amine-associated receptor 1
Ligand
BDBM190643
Substrate
Meas. Tech.
Radioligand Binding Assay
pH
7.4±n/a
Temperature
310.15±n/a K
Ki
3.2±n/a nM
Comments
extracted
Citation
 Galley, GGoergler, ANorcross, RPflieger, P Morpholine compounds and uses thereof US Patent  US9181230 Publication Date 11/10/2015 
Target
Name:
Trace amine-associated receptor 1
Synonyms:
TAAR1_MOUSE Taar1 Trace amine receptor 1 (TARR1) Trace amine-associated receptor1 | Trar1
Type:
Protein
Mol. Mass.:
37635.41
Organism:
Mus musculus (Mouse)
Description:
Q923Y8
Residue:
332
  
Inhibitor
Name:
BDBM190643
Synonyms:
US9181230, 49
Type:
Small organic molecule
Emp. Form.:
C16H14F3N3O
Mol. Mass.:
321.2971
SMILES:
FC(F)(F)c1ccc2c(n1)[nH]c1ccc(cc21)[C@H]1CNCCO1
: