Target
Trace amine-associated receptor 1
Ligand
BDBM190635
Substrate
Meas. Tech.
Radioligand Binding Assay
pH
7.4±n/a
Temperature
310.15±n/a K
Ki
4.3±n/a nM
Comments
extracted
Citation
 Galley, GGoergler, ANorcross, RPflieger, P Morpholine compounds and uses thereof US Patent  US9181230 Publication Date 11/10/2015 
Target
Name:
Trace amine-associated receptor 1
Synonyms:
TAAR1_RAT Taar1 Trace amine receptor 1 (TARR1) Trace amine-associated receptor 1 (TAAR1) Trar1
Type:
Enzyme
Mol. Mass.:
38034.73
Organism:
Rattus norvegicus (Rat)
Description:
Q923Y9
Residue:
332
  
Inhibitor
Name:
BDBM190635
Synonyms:
US9181230, 41
Type:
Small organic molecule
Emp. Form.:
C19H17F2N3O
Mol. Mass.:
341.3546
SMILES:
Fc1ccc(cc1)-c1cc(n[nH]1)-c1ccc(cc1F)[C@@H]1CNCCO1
: