Target
Casein kinase I isoform delta
Ligand
BDBM6644
Substrate
Meas. Tech.
KinaseGlo Plus Luminescent Assay
pH
7.5±n/a
IC50
3.64e+4± 6.4e+3 nM
Comments
extracted
Citation
 Ursu, AIllich, DJTakemoto, YPorfetye, ATZhang, MBrockmeyer, AJanning, PWatanabe, NOsada, HVetter, IRZiegler, SSchöler, HRWaldmann, H Epiblastin A Induces Reprogramming of Epiblast Stem Cells Into Embryonic Stem Cells by Inhibition of Casein Kinase 1. Cell Chem Biol 23:494-507 (2016)  
Target
Name:
Casein kinase I isoform delta
Synonyms:
CKI-delta CSNK1D Casein kinase I delta Casein kinase I isoform delta (CK1D) KC1D_HUMAN | casein kinases 1 delta (CK1 delta)
Type:
Enzyme
Mol. Mass.:
47356.76
Organism:
Homo sapiens (Human)
Description:
P48730
Residue:
415
  
Inhibitor
Name:
BDBM6644
Synonyms:
6‐phenylpteridine‐2,4,7‐triamine (5) Pteridine deriv. 11 | TRIAMTERENE
Type:
Small organic molecule
Emp. Form.:
C12H11N7
Mol. Mass.:
253.2626
SMILES:
Nc1nc(N)c2nc(c(N)nc2n1)-c1ccccc1
: