Target
Casein kinase I isoform delta
Ligand
BDBM191573
Substrate
Meas. Tech.
KinaseGlo Plus Luminescent Assay
pH
7.5±n/a
IC50
6.18e+4± 1.25e+4 nM
Comments
extracted
Citation
 Ursu, AIllich, DJTakemoto, YPorfetye, ATZhang, MBrockmeyer, AJanning, PWatanabe, NOsada, HVetter, IRZiegler, SSchöler, HRWaldmann, H Epiblastin A Induces Reprogramming of Epiblast Stem Cells Into Embryonic Stem Cells by Inhibition of Casein Kinase 1. Cell Chem Biol 23:494-507 (2016)  
Target
Name:
Casein kinase I isoform delta
Synonyms:
CKI-delta CSNK1D Casein kinase I delta Casein kinase I isoform delta (CK1D) KC1D_HUMAN | casein kinases 1 delta (CK1 delta)
Type:
Enzyme
Mol. Mass.:
47356.76
Organism:
Homo sapiens (Human)
Description:
P48730
Residue:
415
  
Inhibitor
Name:
BDBM191573
Synonyms:
6-(3-fluorophenyl)pteridine-2,4,7-triamine (16)
Type:
Small organic molecule
Emp. Form.:
C12H10FN7
Mol. Mass.:
271.2531
SMILES:
Nc1nc(N)c2nc(c(N)nc2n1)-c1cccc(F)c1
: